Target
Aminopeptidase N
Ligand
BDBM50400559
Substrate
Meas. Tech.
ChEMBL_879874 (CHEMBL2211411)
IC50
3400±n/a nM
Citation
 Su, LCao, JJia, YZhang, XFang, HXu, W Development of Synthetic Aminopeptidase N/CD13 Inhibitors to Overcome Cancer Metastasis and Angiogenesis. ACS Med Chem Lett 3:959-964 (2012)  
Target
Name:
Aminopeptidase N
Synonyms:
AMPN_PIG AP-M Alanyl aminopeptidase Aminopeptidase N (APN) Microsomal aminopeptidase pAPN
Type:
Protein
Mol. Mass.:
108810.25
Organism:
Sus scrofa (Pig)
Description:
P15145
Residue:
963
  
Inhibitor
Name:
BDBM50400559
Synonyms:
CHEMBL2204962
Type:
Small organic molecule
Emp. Form.:
C16H25N3O3
Mol. Mass.:
307.388
SMILES:
CC(C)C[C@H](NC(=O)NCCCc1ccccc1)C(=O)NO
: