Target
Aminopeptidase N
Ligand
BDBM50400539
Substrate
Meas. Tech.
ChEMBL_879813 (CHEMBL2210541)
IC50
6900±n/a nM
Citation
 Su, LCao, JJia, YZhang, XFang, HXu, W Development of Synthetic Aminopeptidase N/CD13 Inhibitors to Overcome Cancer Metastasis and Angiogenesis. ACS Med Chem Lett 3:959-964 (2012)  
Target
Name:
Aminopeptidase N
Synonyms:
AMPN_HUMAN APN Aminopeptidase CD_antigen=CD13 Myeloid plasma membrane glycoprotein CD13 gp150 | hAPN
Type:
PROTEIN
Mol. Mass.:
109522.63
Organism:
Homo sapiens (Human)
Description:
ChEMBL_1507526
Residue:
967
  
Inhibitor
Name:
BDBM50400539
Synonyms:
CHEMBL2204952
Type:
Small organic molecule
Emp. Form.:
C15H23N3O4
Mol. Mass.:
309.3608
SMILES:
COc1ccc(CNC(=O)N[C@@H](CC(C)C)C(=O)NO)cc1
: