Target
Macrophage colony-stimulating factor 1 receptor
Ligand
BDBM50400608
Substrate
Meas. Tech.
ChEMBL_880068 (CHEMBL2213417)
IC50
78±n/a nM
Citation
 Liu, GCampbell, BTHolladay, MWFord Pulido, JMHua, HGitnick, DGardner, MFJames, JBreider, MABrigham, DBelli, BArmstrong, RCTreiber, DK Discovery of AC710, a Globally Selective Inhibitor of Platelet-Derived Growth Factor Receptor-Family Kinases. ACS Med Chem Lett 3:997-1002 (2012)  
Target
Name:
Macrophage colony-stimulating factor 1 receptor
Synonyms:
CSF1R_MOUSE Csfmr Macrophage colony-stimulating factor 1 receptor Proto-oncogene c-Fms
Type:
Protein
Mol. Mass.:
109173.45
Organism:
Mus musculus (Mouse)
Description:
P09581
Residue:
977
  
Inhibitor
Name:
BDBM50400608
Synonyms:
CHEMBL2203435
Type:
Small organic molecule
Emp. Form.:
C28H36N6O4
Mol. Mass.:
520.6232
SMILES:
CC(C)N1CCC(CC1)Oc1ccc(nc1)C(=O)Nc1ccc(NC(=O)Nc2cc(on2)C(C)(C)C)cc1
: