Target
Macrophage colony-stimulating factor 1 receptor
Ligand
BDBM50400615
Substrate
Meas. Tech.
ChEMBL_880068 (CHEMBL2213417)
IC50
74.7±n/a nM
Citation
 Liu, GCampbell, BTHolladay, MWFord Pulido, JMHua, HGitnick, DGardner, MFJames, JBreider, MABrigham, DBelli, BArmstrong, RCTreiber, DK Discovery of AC710, a Globally Selective Inhibitor of Platelet-Derived Growth Factor Receptor-Family Kinases. ACS Med Chem Lett 3:997-1002 (2012)  
Target
Name:
Macrophage colony-stimulating factor 1 receptor
Synonyms:
CSF1R_MOUSE Csfmr Macrophage colony-stimulating factor 1 receptor Proto-oncogene c-Fms
Type:
Protein
Mol. Mass.:
109173.45
Organism:
Mus musculus (Mouse)
Description:
P09581
Residue:
977
  
Inhibitor
Name:
BDBM50400615
Synonyms:
CHEMBL2206279
Type:
Small organic molecule
Emp. Form.:
C29H38N6O4
Mol. Mass.:
534.6498
SMILES:
CC(C)(C)c1cc(NC(=O)Nc2ccc(NC(=O)c3ccc(OC4CC(C)(C)NC(C)(C)C4)cn3)cc2)no1
: