Target
Serine/threonine-protein kinase 33
Ligand
BDBM50400664
Substrate
Meas. Tech.
ChEMBL_880288 (CHEMBL2216290)
IC50
14±n/a nM
Citation
 Weïwer, MSpoonamore, JWei, JGuichard, BRoss, NTMasson, KSilkworth, WDandapani, SPalmer, MScherer, CAStern, AMSchreiber, SLMunoz, B A Potent and Selective Quinoxalinone-Based STK33 Inhibitor Does Not Show Synthetic Lethality in KRAS-Dependent Cells. ACS Med Chem Lett 3:1034-1038 (2012)  
Target
Name:
Serine/threonine-protein kinase 33
Synonyms:
STK33 Serine/threonine-protein kinase 33
Type:
Enzyme Catalytic Domain
Mol. Mass.:
57833.21
Organism:
Homo sapiens (Human)
Description:
gi_23943882
Residue:
514
  
Inhibitor
Name:
BDBM50400664
Synonyms:
CHEMBL2204239
Type:
Small organic molecule
Emp. Form.:
C22H19N3O2S
Mol. Mass.:
389.47
SMILES:
CC(C)c1ccc(NC(=O)c2cccs2)c(c1)-c1nc2ccccc2[nH]c1=O
: