Target
Serine/threonine-protein kinase 33
Ligand
BDBM50400675
Substrate
Meas. Tech.
ChEMBL_880288 (CHEMBL2216290)
IC50
>10000±n/a nM
Citation
 Weïwer, MSpoonamore, JWei, JGuichard, BRoss, NTMasson, KSilkworth, WDandapani, SPalmer, MScherer, CAStern, AMSchreiber, SLMunoz, B A Potent and Selective Quinoxalinone-Based STK33 Inhibitor Does Not Show Synthetic Lethality in KRAS-Dependent Cells. ACS Med Chem Lett 3:1034-1038 (2012)  
Target
Name:
Serine/threonine-protein kinase 33
Synonyms:
STK33 Serine/threonine-protein kinase 33
Type:
Enzyme Catalytic Domain
Mol. Mass.:
57833.21
Organism:
Homo sapiens (Human)
Description:
gi_23943882
Residue:
514
  
Inhibitor
Name:
BDBM50400675
Synonyms:
CHEMBL2204228
Type:
Small organic molecule
Emp. Form.:
C21H16FN3O
Mol. Mass.:
345.3696
SMILES:
Fc1ccc(CNc2ccccc2-c2nc3ccccc3[nH]c2=O)cc1
: