Target
Serine/threonine-protein kinase 33
Ligand
BDBM50400683
Substrate
Meas. Tech.
ChEMBL_880288 (CHEMBL2216290)
IC50
580±n/a nM
Citation
 Weïwer, MSpoonamore, JWei, JGuichard, BRoss, NTMasson, KSilkworth, WDandapani, SPalmer, MScherer, CAStern, AMSchreiber, SLMunoz, B A Potent and Selective Quinoxalinone-Based STK33 Inhibitor Does Not Show Synthetic Lethality in KRAS-Dependent Cells. ACS Med Chem Lett 3:1034-1038 (2012)  
Target
Name:
Serine/threonine-protein kinase 33
Synonyms:
STK33 Serine/threonine-protein kinase 33
Type:
Enzyme Catalytic Domain
Mol. Mass.:
57833.21
Organism:
Homo sapiens (Human)
Description:
gi_23943882
Residue:
514
  
Inhibitor
Name:
BDBM50400683
Synonyms:
CHEMBL2203529
Type:
Small organic molecule
Emp. Form.:
C20H14N4O2
Mol. Mass.:
342.3508
SMILES:
O=C(Nc1ccccc1-c1nc2ccccc2[nH]c1=O)c1cccnc1
: