Target
Neuronal acetylcholine receptor; alpha2/beta4
Ligand
BDBM50400739
Substrate
Meas. Tech.
ChEMBL_880410 (CHEMBL2210093)
Ki
1820±n/a nM
Citation
 Yu, LFZhang, HKGunosewoyo, HKozikowski, AP From a4ß2 Nicotinic Ligands to the Discovery of s1 Receptor Ligands: Pharmacophore Analysis and Rational Design. ACS Med Chem Lett 3:1054-1058 (2012)  
Target
Name:
Neuronal acetylcholine receptor; alpha2/beta4
Synonyms:
Neuronal acetylcholine receptor protein alpha-2 subunit/subunit beta-4 | Neuronal acetylcholine receptor subunit alpha-2/beta-4
Type:
Mol. Mass.:
Description:
ASSAY_ID of ChEMBL is 2150172
Components:
This complex has 2 components.
Component 1
Name:
Neuronal acetylcholine receptor subunit beta-4
Synonyms:
ACHB4_HUMAN Cholinergic, Nicotinic Alpha6Beta3Beta4Alpha5 Nicotinic acetylcholine receptor alpha6/alpha3/beta4
Type:
Enzyme Catalytic Domain
Mol. Mass.:
56388.51
Organism:
Homo sapiens (Human)
Description:
Cholinergic, Nicotinic Alpha6Beta3Beta4Alpha5 0 HUMAN::P30926
Residue:
498
  
Component 2
Name:
Neuronal acetylcholine receptor subunit alpha-2
Synonyms:
ACHA2_HUMAN Neuronal acetylcholine receptor; alpha2/beta2
Type:
Enzyme Catalytic Domain
Mol. Mass.:
59759.69
Organism:
Homo sapiens (Human)
Description:
Cholinergic, Nicotinic Alpha2Beta2 0 HUMAN::Q15822
Residue:
529
  
Inhibitor
Name:
BDBM50400739
Synonyms:
CHEMBL2203550
Type:
Small organic molecule
Emp. Form.:
C13H14ClN3O3
Mol. Mass.:
295.722
SMILES:
Clc1cncc(OCc2cc(OC[C@@H]3CCN3)no2)c1
: