Target
DNA (cytosine-5)-methyltransferase 3A
Ligand
BDBM50400778
Substrate
Meas. Tech.
ChEMBL_879147 (CHEMBL2209118)
IC50
>100000±n/a nM
Citation
 Verma, SKTian, XLaFrance, LVDuquenne, CSuarez, DPNewlander, KARomeril, SPBurgess, JLGrant, SWBrackley, JAGraves, APScherzer, DAShu, AThompson, COtt, HMAller, GSMachutta, CADiaz, EJiang, YJohnson, NWKnight, SDKruger, RGMcCabe, MTDhanak, DTummino, PJCreasy, CLMiller, WH Identification of Potent, Selective, Cell-Active Inhibitors of the Histone Lysine Methyltransferase EZH2. ACS Med Chem Lett 3:1091-1096 (2012)  
Target
Name:
DNA (cytosine-5)-methyltransferase 3A
Synonyms:
DNA (cytosine-5)-methyltransferase 3A DNA methyltransferase HsaIIIA DNMT3A M.HsaIIIA | tyrosine-protein phosphatase non-receptor type 12 isoform 2
Type:
PROTEIN
Mol. Mass.:
101857.24
Organism:
Homo sapiens (Human)
Description:
ChEMBL_1510405
Residue:
912
  
Inhibitor
Name:
BDBM50400778
Synonyms:
CHEMBL2204995
Type:
Small organic molecule
Emp. Form.:
C31H39N7O2
Mol. Mass.:
541.6871
SMILES:
CCCc1cc(C)[nH]c(=O)c1CNC(=O)c1cc(cc2n(ncc12)C(C)C)-c1ccnc(c1)N1CCN(C)CC1
: