Target
Neprilysin
Ligand
BDBM50400808
Substrate
Meas. Tech.
ChEMBL_879250 (CHEMBL2208603)
IC50
0.800000±n/a nM
Citation
 Marsault, EPeterson, ML Macrocycles are great cycles: applications, opportunities, and challenges of synthetic macrocycles in drug discovery. J Med Chem 54:1961-2004 (2011)  
Target
Name:
Neprilysin
Synonyms:
Atriopeptidase CD_antigen=CD10 EPN MME NEP_HUMAN Neutral endopeptidase | Neutral endopeptidase 24.11
Type:
Enzyme
Mol. Mass.:
85505.38
Organism:
Homo sapiens (Human)
Description:
P08473
Residue:
750
  
Inhibitor
Name:
BDBM50400808
Synonyms:
CHEMBL2204326
Type:
Small organic molecule
Emp. Form.:
C16H26N2O5S
Mol. Mass.:
358.453
SMILES:
O[C@@H]1C[C@H](N(C1)C(=O)[C@@H]1CCCCCC[C@@H](CS)C(=O)N1)C(O)=O
: