Target
Prostaglandin E2 receptor EP3 subtype
Ligand
BDBM50193921
Substrate
Meas. Tech.
ChEMBL_879335 (CHEMBL2208733)
Ki
1.1±n/a nM
Citation
 Meanwell, NA Synopsis of some recent tactical application of bioisosteres in drug design. J Med Chem 54:2529-91 (2011)  
Target
Name:
Prostaglandin E2 receptor EP3 subtype
Synonyms:
PE2R3_HUMAN PGE2-R Prostaglandin E2 receptor Prostaglandin E2 receptor EP3 subtype (EP3) Prostaglandin E2 receptor EP3D subtype (EP3D) | Prostanoid EP3 receptor
Type:
Enzyme
Mol. Mass.:
43335.03
Organism:
Homo sapiens (Human)
Description:
P43115
Residue:
390
  
Inhibitor
Name:
BDBM50193921
Synonyms:
3-(2-(naphthalen-2-ylmethyl)phenyl)-N-(thiophen-2-ylsulfonyl)acrylamide | CHEMBL220802
Type:
Small organic molecule
Emp. Form.:
C24H19NO3S2
Mol. Mass.:
433.543
SMILES:
O=C(NS(=O)(=O)c1cccs1)\C=C\c1ccccc1Cc1ccc2ccccc2c1
: