Target
Angiotensin-converting enzyme
Ligand
BDBM50398088
Substrate
Meas. Tech.
ChEMBL_879312 (CHEMBL2208710)
IC50
3.8±n/a nM
Citation
 Meanwell, NA Synopsis of some recent tactical application of bioisosteres in drug design. J Med Chem 54:2529-91 (2011)  
Target
Name:
Angiotensin-converting enzyme
Synonyms:
ACE Angiotensin converting enzyme (ACE) Angiotensin-converting enzyme, soluble form CD_antigen=CD143 DCP1 Kininase II
Type:
Enzyme
Mol. Mass.:
149709.01
Organism:
Homo sapiens (Human)
Description:
Residue:
1306
  
Inhibitor
Name:
BDBM50398088
Synonyms:
CHEMBL2097001
Type:
Small organic molecule
Emp. Form.:
C24H30N2O6Si
Mol. Mass.:
470.5903
SMILES:
C[C@H](C[Si](O)(O)[C@H](Cc1ccccc1)NC(=O)c1ccccc1)C(=O)N1CCC[C@H]1C(O)=O
: