Target
Fatty-acid amide hydrolase 1
Ligand
BDBM50204525
Substrate
Meas. Tech.
ChEMBL_879293 (CHEMBL2208691)
Ki
5±n/a nM
Citation
 Meanwell, NA Synopsis of some recent tactical application of bioisosteres in drug design. J Med Chem 54:2529-91 (2011)  
Target
Name:
Fatty-acid amide hydrolase 1
Synonyms:
Anandamide amidohydrolase FAAH FAAH1_HUMAN Fatty-acid amide hydrolase (FAAH) Oleamide hydrolase 1
Type:
Protein
Mol. Mass.:
63071.19
Organism:
Homo sapiens (Human)
Description:
O00519
Residue:
579
  
Inhibitor
Name:
BDBM50204525
Synonyms:
2-(7-phenylheptanoyl)oxazole-5-carboxamide | CHEMBL219675
Type:
Small organic molecule
Emp. Form.:
C17H20N2O3
Mol. Mass.:
300.3523
SMILES:
NC(=O)c1cnc(o1)C(=O)CCCCCCc1ccccc1
: