Target
Neutrophil elastase
Ligand
BDBM50031199
Substrate
Meas. Tech.
ChEMBL_879292 (CHEMBL2208690)
Ki
3±n/a nM
Citation
 Meanwell, NA Synopsis of some recent tactical application of bioisosteres in drug design. J Med Chem 54:2529-91 (2011)  
Target
Name:
Neutrophil elastase
Synonyms:
Bone marrow serine protease Coagulation factor X ELANE Elastase HLE Leukocyte elastase Medullasin Neutrophil elastase (HNE) PMN elastase Trypsin
Type:
Enzyme
Mol. Mass.:
28532.38
Organism:
Homo sapiens (Human)
Description:
P08246
Residue:
267
  
Inhibitor
Name:
BDBM50031199
Synonyms:
((S)-1-{(S)-2-[(S)-1-(Benzooxazole-2-carbonyl)-2-methyl-propylcarbamoyl]-pyrrolidine-1-carbonyl}-2-methyl-propyl)-carbamic acid benzyl ester Cbz-Val-Pro-Val-(2-benzoxazole)
Type:
Small organic molecule
Emp. Form.:
C30H36N4O6
Mol. Mass.:
548.63
SMILES:
CC(C)[C@H](NC(=O)OCc1ccccc1)C(=O)N1CCC[C@H]1C(=O)N[C@@H](C(C)C)C(=O)c1nc2ccccc2o1
: