Target
Poly [ADP-ribose] polymerase 1
Ligand
BDBM50154721
Substrate
Meas. Tech.
ChEMBL_879278 (CHEMBL2208631)
Ki
121±n/a nM
Citation
 Meanwell, NA Synopsis of some recent tactical application of bioisosteres in drug design. J Med Chem 54:2529-91 (2011)  
Target
Name:
Poly [ADP-ribose] polymerase 1
Synonyms:
(ARTD1 or PARP1) 2.4.2.30 ADPRT ARTD1 Human diphtheria toxin-like ADP-ribosyltransferase (ARTD1 or PARP1) NT-PARP-1 PARP1 PPOL Poly [ADP-ribose] polymerase 1 (PARP) Poly [ADP-ribose] polymerase 1 (PARP1) Poly [ADP-ribose] polymerase 1, 28-kDa form Poly [ADP-ribose] polymerase 1, processed C-terminus Poly [ADP-ribose] polymerase-1 Poly(ADP-ribose) polymerase-1 (ARTD1/PARP1) Protein poly-ADP-ribosyltransferase PARP1 | Synonyms=ADPRT
Type:
Mol. Mass.:
113114.22
Organism:
Homo sapiens (Human)
Description:
P09874
Residue:
1014
  
Inhibitor
Name:
BDBM50154721
Synonyms:
1-Oxo-1,2,3,4-tetrahydro-[1,4]diazepino[6,7,1-hi]indole-7-carbaldehyde O-methyl-oxime | CHEMBL363978
Type:
Small organic molecule
Emp. Form.:
C13H13N3O2
Mol. Mass.:
243.2612
SMILES:
CO\N=C/c1cn2CCNC(=O)c3cccc1c23
: