Target
Peptidyl-prolyl cis-trans isomerase FKBP1A
Ligand
BDBM50400862
Substrate
Meas. Tech.
ChEMBL_879285 (CHEMBL2208638)
Ki
19±n/a nM
Citation
 Meanwell, NA Synopsis of some recent tactical application of bioisosteres in drug design. J Med Chem 54:2529-91 (2011)  
Target
Name:
Peptidyl-prolyl cis-trans isomerase FKBP1A
Synonyms:
12 kDa FK506-binding protein FK506-binding protein 1A FKB1A_HUMAN FKBP-1A FKBP12 Immunophilin FKBP12 PPIase FKBP1A Rotamase mTOR/FKBP12A/FKBP12B
Type:
Isomerase
Mol. Mass.:
11953.09
Organism:
Homo sapiens (Human)
Description:
P62942
Residue:
108
  
Inhibitor
Name:
BDBM50400862
Synonyms:
CHEMBL2205015
Type:
Small organic molecule
Emp. Form.:
C35H42F2N2O6
Mol. Mass.:
624.7146
SMILES:
COc1cc(cc(OC)c1OC)C(F)(F)C(=O)N1CCCC[C@H]1C(=O)OC(CCCc1ccccc1)CCCc1cccnc1
: