Target
5-hydroxytryptamine receptor 3A
Ligand
BDBM50400904
Substrate
Meas. Tech.
ChEMBL_880265 (CHEMBL2215843)
Ki
32±n/a nM
Citation
 Bang-Andersen, BRuhland, TJørgensen, MSmith, GFrederiksen, KJensen, KGZhong, HNielsen, SMHogg, SMørk, AStensbøl, TB Discovery of 1-[2-(2,4-dimethylphenylsulfanyl)phenyl]piperazine (Lu AA21004): a novel multimodal compound for the treatment of major depressive disorder. J Med Chem 54:3206-21 (2011)  
Target
Name:
5-hydroxytryptamine receptor 3A
Synonyms:
5-HT-3 5-HT3A 5-hydroxytryptamine receptor 3 (5-HT3) 5-hydroxytryptamine receptor 3A (5HT3A) 5HT3R HTR3A Serotonin 3 receptor (5HT3) Serotonin-gated ion channel receptor | Serotonin-gated ion channel receptor 3
Type:
Protein
Mol. Mass.:
55283.27
Organism:
Homo sapiens (Human)
Description:
P46098
Residue:
478
  
Inhibitor
Name:
BDBM50400904
Synonyms:
CHEMBL2204358
Type:
Small organic molecule
Emp. Form.:
C18H22N2O2S
Mol. Mass.:
330.444
SMILES:
COc1ccc(Sc2ccccc2N2CCNCC2)c(OC)c1
: