Target
Sodium-dependent serotonin transporter
Ligand
BDBM50400911
Substrate
Meas. Tech.
ChEMBL_880263 (CHEMBL2215841)
IC50
44±n/a nM
Citation
 Bang-Andersen, BRuhland, TJørgensen, MSmith, GFrederiksen, KJensen, KGZhong, HNielsen, SMHogg, SMørk, AStensbøl, TB Discovery of 1-[2-(2,4-dimethylphenylsulfanyl)phenyl]piperazine (Lu AA21004): a novel multimodal compound for the treatment of major depressive disorder. J Med Chem 54:3206-21 (2011)  
Target
Name:
Sodium-dependent serotonin transporter
Synonyms:
5-HT Transporter 5HT transporter Anandamid membrane transporter, AMT Monoamine transporters; Norepinephrine & serotonin Slc6a4 Sodium-dependent serotonin transporter (SERT) | imipramine receptor
Type:
Multi-pass membrane protein
Mol. Mass.:
70168.43
Organism:
Rattus norvegicus (rat)
Description:
P31652
Residue:
630
  
Inhibitor
Name:
BDBM50400911
Synonyms:
CHEMBL2204364
Type:
Small organic molecule
Emp. Form.:
C19H24N2S
Mol. Mass.:
312.472
SMILES:
Cc1ccc(Sc2cccc(C)c2N2CCNCC2)c(C)c1
: