Target
Arylsulfatase
Ligand
BDBM50400983
Substrate
Meas. Tech.
ChEMBL_879583 (CHEMBL2209033)
IC50
800000±n/a nM
Citation
 Lenger, JSchröder, MEnnemann, ECMüller, BWong, CHNoll, TDierks, THanson, SRSewald, N Evaluation of sulfatase-directed quinone methide traps for proteomics. Bioorg Med Chem 20:622-7 (2012)  
Target
Name:
Arylsulfatase
Synonyms:
AS Aryl-sulfate sulphohydrolase | atsA
Type:
PROTEIN
Mol. Mass.:
64155.34
Organism:
Klebsiella pneumoniae
Description:
ChEMBL_879573
Residue:
577
  
Inhibitor
Name:
BDBM50400983
Synonyms:
CHEMBL2205726
Type:
Small organic molecule
Emp. Form.:
C14H21FN2O7S
Mol. Mass.:
380.389
SMILES:
[NH3+]CCOCCOCCNC(=O)C(F)c1ccc(OS([O-])(=O)=O)cc1
: