Target
Thyroid hormone receptor beta
Ligand
BDBM18920
Substrate
Meas. Tech.
ChEMBL_883199 (CHEMBL2212125)
EC50
2.9±n/a nM
Citation
 Joharapurkar, AADhote, VVJain, MR Selective thyromimetics using receptor and tissue selectivity approaches: prospects for dyslipidemia. J Med Chem 55:5649-75 (2012)  
Target
Name:
Thyroid hormone receptor beta
Synonyms:
ERBA2 Nuclear receptor subfamily 1 group A member 2 THR1 c-erbA-2 | c-erbA-beta
Type:
Receptor
Mol. Mass.:
52793.62
Organism:
Homo sapiens (Human)
Description:
Recombinant hThR was obtained from nuclear extracts from SF9 cells infected with baculovirus vectors encoding for ThRbeta 1.
Residue:
461
  
Inhibitor
Name:
BDBM18920
Synonyms:
2-[3,5-dichloro-4-(4-hydroxy-3-phenylphenoxy)phenyl]acetic acid | 4-hydroxy thyromimetic, 9a
Type:
Small organic molecule
Emp. Form.:
C20H14Cl2O4
Mol. Mass.:
389.229
SMILES:
OC(=O)Cc1cc(Cl)c(Oc2ccc(O)c(c2)-c2ccccc2)c(Cl)c1
: