Target
Thioredoxin, mitochondrial
Ligand
BDBM50366237
Substrate
Meas. Tech.
ChEMBL_884453 (CHEMBL2212215)
Ki
1310±n/a nM
Citation
 Yang, JLi, CDing, LGuo, QYou, QJin, S Gambogic acid deactivates cytosolic and mitochondrial thioredoxins by covalent binding to the functional domain. J Nat Prod 75:1108-16 (2012)  
Target
Name:
Thioredoxin, mitochondrial
Synonyms:
MTRX THIOM_HUMAN TXN2 | Thioredoxin-2
Type:
PROTEIN
Mol. Mass.:
18386.61
Organism:
Homo sapiens (Human)
Description:
ChEMBL_884453
Residue:
166
  
Inhibitor
Name:
BDBM50366237
Synonyms:
GAMBOGIC ACID
Type:
Small organic molecule
Emp. Form.:
C38H44O8
Mol. Mass.:
628.7512
SMILES:
[#6]\[#6](-[#6])=[#6]\[#6]-[#6][C@@]1([#6])[#8]-c2c(-[#6]\[#6]=[#6](\[#6])-[#6])c3-[#8][C@@]45[#6@H]6-[#6]-[#6@@H](-[#6]=[#6]4-[#6](=O)-c3c(-[#8])c2-[#6]=[#6]1)-[#6](=O)[C@]5([#6]\[#6]=[#6](\[#6])-[#6](-[#8])=O)[#8]C6([#6])[#6]
: