Target
Mitogen-activated protein kinase kinase kinase 1
Ligand
BDBM50401152
Substrate
Meas. Tech.
ChEMBL_881218 (CHEMBL2211523)
IC50
<10000±n/a nM
Citation
 Sunose, MBell, KEllard, KBergamini, GNeubauer, GWerner, TRamsden, N Discovery of 5-(2-amino-[1,2,4]triazolo[1,5-a]pyridin-7-yl)-N-(tert-butyl)pyridine-3-sulfonamide (CZC24758), as a potent, orally bioavailable and selective inhibitor of PI3K for the treatment of inflammatory disease. Bioorg Med Chem Lett 22:4613-8 (2012)  
Target
Name:
Mitogen-activated protein kinase kinase kinase 1
Synonyms:
M3K1_HUMAN MAPK/ERK kinase kinase 1 MEK Kinase 1 (MEKK1) MEKK1
Type:
Serine/threonine-protein kinase
Mol. Mass.:
164491.32
Organism:
Homo sapiens (Human)
Description:
Residue:
1512
  
Inhibitor
Name:
BDBM50401152
Synonyms:
CHEMBL2205766
Type:
Small organic molecule
Emp. Form.:
C15H18N6O2S
Mol. Mass.:
346.407
SMILES:
CC(C)(C)NS(=O)(=O)c1cncc(c1)-c1ccn2nc(N)nc2c1
: