Target
Dual specificity mitogen-activated protein kinase kinase 5
Ligand
BDBM50401152
Substrate
Meas. Tech.
ChEMBL_881217 (CHEMBL2211522)
IC50
<10000±n/a nM
Citation
 Sunose, MBell, KEllard, KBergamini, GNeubauer, GWerner, TRamsden, N Discovery of 5-(2-amino-[1,2,4]triazolo[1,5-a]pyridin-7-yl)-N-(tert-butyl)pyridine-3-sulfonamide (CZC24758), as a potent, orally bioavailable and selective inhibitor of PI3K for the treatment of inflammatory disease. Bioorg Med Chem Lett 22:4613-8 (2012)  
Target
Name:
Dual specificity mitogen-activated protein kinase kinase 5
Synonyms:
MAP kinase kinase 5 MAPK/ERK kinase 5 MEK5 MP2K5_HUMAN | PRKMK5
Type:
PROTEIN
Mol. Mass.:
50110.16
Organism:
Homo sapiens (Human)
Description:
ChEMBL_1495740
Residue:
448
  
Inhibitor
Name:
BDBM50401152
Synonyms:
CHEMBL2205766
Type:
Small organic molecule
Emp. Form.:
C15H18N6O2S
Mol. Mass.:
346.407
SMILES:
CC(C)(C)NS(=O)(=O)c1cncc(c1)-c1ccn2nc(N)nc2c1
: