Target
LIM domain kinase 1
Ligand
BDBM50401152
Substrate
Meas. Tech.
ChEMBL_881212 (CHEMBL2211517)
IC50
<10000±n/a nM
Citation
 Sunose, MBell, KEllard, KBergamini, GNeubauer, GWerner, TRamsden, N Discovery of 5-(2-amino-[1,2,4]triazolo[1,5-a]pyridin-7-yl)-N-(tert-butyl)pyridine-3-sulfonamide (CZC24758), as a potent, orally bioavailable and selective inhibitor of PI3K for the treatment of inflammatory disease. Bioorg Med Chem Lett 22:4613-8 (2012)  
Target
Name:
LIM domain kinase 1
Synonyms:
LIMK LIMK1 | LIMK1_HUMAN
Type:
Enzyme Catalytic Domain
Mol. Mass.:
72591.81
Organism:
Homo sapiens (Human)
Description:
gi_4505001
Residue:
647
  
Inhibitor
Name:
BDBM50401152
Synonyms:
CHEMBL2205766
Type:
Small organic molecule
Emp. Form.:
C15H18N6O2S
Mol. Mass.:
346.407
SMILES:
CC(C)(C)NS(=O)(=O)c1cncc(c1)-c1ccn2nc(N)nc2c1
: