Target
C-C chemokine receptor type 5
Ligand
BDBM50092158
Substrate
Meas. Tech.
ChEMBL_884038 (CHEMBL2215087)
EC50
5011.87±n/a nM
Citation
 Thiele, SMalmgaard-Clausen, MEngel-Andreasen, JSteen, ARummel, PCNielsen, MCGloriam, DEFrimurer, TMUlven, TRosenkilde, MM Modulation in selectivity and allosteric properties of small-molecule ligands for CC-chemokine receptors. J Med Chem 55:8164-77 (2012)  
Target
Name:
C-C chemokine receptor type 5
Synonyms:
C-C CKR-5 CC-CKR-5 CCR5 CCR5_HUMAN CHEMR13 HIV-1 fusion coreceptor
Type:
Enzyme
Mol. Mass.:
40540.21
Organism:
Homo sapiens (Human)
Description:
P51681
Residue:
352
  
Inhibitor
Name:
BDBM50092158
Synonyms:
1,10-phenanthroline US10669227, Compound 1,10-phenanthroline US9187406, 1,10-phenanthroline | cid_1318
Type:
Small organic molecule
Emp. Form.:
C12H8N2
Mol. Mass.:
180.2053
SMILES:
c1cnc2c(c1)ccc1cccnc21
: