Target
C-C chemokine receptor type 1
Ligand
BDBM38924
Substrate
Meas. Tech.
ChEMBL_884039 (CHEMBL2215088)
EC50
64000±n/a nM
Citation
 Thiele, SMalmgaard-Clausen, MEngel-Andreasen, JSteen, ARummel, PCNielsen, MCGloriam, DEFrimurer, TMUlven, TRosenkilde, MM Modulation in selectivity and allosteric properties of small-molecule ligands for CC-chemokine receptors. J Med Chem 55:8164-77 (2012)  
Target
Name:
C-C chemokine receptor type 1
Synonyms:
C-C CKR-1 CC-CKR-1 CCR1 CD_antigen=CD191 CMKR1 LD78 receptor Macrophage inflammatory protein 1-alpha receptor SCYAR1
Type:
Enzyme
Mol. Mass.:
41180.69
Organism:
Homo sapiens (Human)
Description:
P32246
Residue:
355
  
Inhibitor
Name:
BDBM38924
Synonyms:
2,6-bis(2-pyridinyl)pyridine 2,6-dipyridin-2-ylpyridine SMR000060049 | cid_70848
Type:
Small organic molecule
Emp. Form.:
C15H11N3
Mol. Mass.:
233.2679
SMILES:
c1ccc(nc1)-c1cccc(n1)-c1ccccn1
: