Target
C-C chemokine receptor type 1
Ligand
BDBM50401343
Substrate
Meas. Tech.
ChEMBL_884039 (CHEMBL2215088)
EC50
5000±n/a nM
Citation
 Thiele, SMalmgaard-Clausen, MEngel-Andreasen, JSteen, ARummel, PCNielsen, MCGloriam, DEFrimurer, TMUlven, TRosenkilde, MM Modulation in selectivity and allosteric properties of small-molecule ligands for CC-chemokine receptors. J Med Chem 55:8164-77 (2012)  
Target
Name:
C-C chemokine receptor type 1
Synonyms:
C-C CKR-1 CC-CKR-1 CCR1 CD_antigen=CD191 CMKR1 LD78 receptor Macrophage inflammatory protein 1-alpha receptor SCYAR1
Type:
Enzyme
Mol. Mass.:
41180.69
Organism:
Homo sapiens (Human)
Description:
P32246
Residue:
355
  
Inhibitor
Name:
BDBM50401343
Synonyms:
CHEMBL2205801
Type:
Small organic molecule
Emp. Form.:
C14H8N2O2
Mol. Mass.:
236.2255
SMILES:
O=Cc1ccnc2c1ccc1c(C=O)ccnc21
: