Target
C-C chemokine receptor type 1
Ligand
BDBM64740
Substrate
Meas. Tech.
ChEMBL_884039 (CHEMBL2215088)
EC50
1600±n/a nM
Citation
 Thiele, SMalmgaard-Clausen, MEngel-Andreasen, JSteen, ARummel, PCNielsen, MCGloriam, DEFrimurer, TMUlven, TRosenkilde, MM Modulation in selectivity and allosteric properties of small-molecule ligands for CC-chemokine receptors. J Med Chem 55:8164-77 (2012)  
Target
Name:
C-C chemokine receptor type 1
Synonyms:
C-C CKR-1 CC-CKR-1 CCR1 CD_antigen=CD191 CMKR1 LD78 receptor Macrophage inflammatory protein 1-alpha receptor SCYAR1
Type:
Enzyme
Mol. Mass.:
41180.69
Organism:
Homo sapiens (Human)
Description:
P32246
Residue:
355
  
Inhibitor
Name:
BDBM64740
Synonyms:
2,9-dimethyl-1,10-phenanthroline SMR000555011 | cid_65237
Type:
Small organic molecule
Emp. Form.:
C14H12N2
Mol. Mass.:
208.2585
SMILES:
Cc1ccc2ccc3ccc(C)nc3c2n1
: