Target
Sigma non-opioid intracellular receptor 1
Ligand
BDBM50401370
Substrate
Meas. Tech.
ChEMBL_884050 (CHEMBL2215099)
Ki
10±n/a nM
Citation
 Banister, SDManoli, MDoddareddy, MRHibbs, DEKassiou, M As(1) receptor pharmacophore derived from a series of N-substituted 4-azahexacyclo[5.4.1.0(2,6).0(3,10).0(5,9).0(8,11)]dodecan-3-ols (AHDs). Bioorg Med Chem Lett 22:6053-8 (2012)  
Target
Name:
Sigma non-opioid intracellular receptor 1
Synonyms:
Opioid receptor SGMR1_RAT Sigma non-opioid intracellular receptor 1 Sigma-1 | Sigmar1
Type:
Enzyme Catalytic Domain
Mol. Mass.:
25266.54
Organism:
RAT
Description:
Q9R0C9
Residue:
223
  
Inhibitor
Name:
BDBM50401370
Synonyms:
CHEMBL2205821
Type:
Small organic molecule
Emp. Form.:
C21H25NO
Mol. Mass.:
307.4293
SMILES:
OC12C3C4C5C3C(C3C5CC4C13)N2CCCCc1ccccc1
: