Target
Metabotropic glutamate receptor 2
Ligand
BDBM50401396
Substrate
Meas. Tech.
ChEMBL_881600 (CHEMBL2215923)
EC50
10.5±n/a nM
Citation
 Andrés, JIAlcázar, JCid, JMDe Angelis, MIturrino, LLanglois, XLavreysen, HTrabanco, AACelen, SBormans, G Synthesis, evaluation, and radiolabeling of new potent positive allosteric modulators of the metabotropic glutamate receptor 2 as potential tracers for positron emission tomography imaging. J Med Chem 55:8685-99 (2012)  
Target
Name:
Metabotropic glutamate receptor 2
Synonyms:
GPRC1B GRM2_HUMAN Metabotropic glutamate receptor mGlu2 | metabotropic glutamate 2
Type:
Enzyme
Mol. Mass.:
95584.88
Organism:
Homo sapiens (Human)
Description:
Q14416
Residue:
872
  
Inhibitor
Name:
BDBM50401396
Synonyms:
CHEMBL2206439
Type:
Small organic molecule
Emp. Form.:
C20H19ClF4N4O
Mol. Mass.:
442.838
SMILES:
COc1ccc(F)cc1C1CCN(CC1)c1ccn2c(CC(F)(F)F)nnc2c1Cl
: