Target
Cytochrome P450 1A2
Ligand
BDBM50401421
Substrate
Meas. Tech.
ChEMBL_883348 (CHEMBL2214084)
IC50
>10000±n/a nM
Citation
 Bavetsias, VCrumpler, SSun, CAvery, SAtrash, BFaisal, AMoore, ASKosmopoulou, MBrown, NSheldrake, PWBush, KHenley, ABox, GValenti, Mde Haven Brandon, ARaynaud, FIWorkman, PEccles, SABayliss, RLinardopoulos, SBlagg, J Optimization of imidazo[4,5-b]pyridine-based kinase inhibitors: identification of a dual FLT3/Aurora kinase inhibitor as an orally bioavailable preclinical development candidate for the treatment of acute myeloid leukemia. J Med Chem 55:8721-34 (2012)  
Target
Name:
Cytochrome P450 1A2
Synonyms:
CP1A2_HUMAN CYPIA2 Cytochrome P(3)450 Cytochrome P450 1A2 (CYP1A2) Cytochrome P450-P3
Type:
Enzyme
Mol. Mass.:
58423.38
Organism:
Homo sapiens (Human)
Description:
P05177
Residue:
516
  
Inhibitor
Name:
BDBM50401421
Synonyms:
CHEMBL2207503
Type:
Small organic molecule
Emp. Form.:
C22H23Cl2N7
Mol. Mass.:
456.371
SMILES:
Cc1nn(C)cc1-c1nc2ncc(Cl)c(N3CCN(Cc4ccc(Cl)cc4)CC3)c2[nH]1
: