Target
Potassium voltage-gated channel subfamily H member 2
Ligand
BDBM50401434
Substrate
Meas. Tech.
ChEMBL_883358 (CHEMBL2214094)
IC50
11000±n/a nM
Citation
 Bavetsias, VCrumpler, SSun, CAvery, SAtrash, BFaisal, AMoore, ASKosmopoulou, MBrown, NSheldrake, PWBush, KHenley, ABox, GValenti, Mde Haven Brandon, ARaynaud, FIWorkman, PEccles, SABayliss, RLinardopoulos, SBlagg, J Optimization of imidazo[4,5-b]pyridine-based kinase inhibitors: identification of a dual FLT3/Aurora kinase inhibitor as an orally bioavailable preclinical development candidate for the treatment of acute myeloid leukemia. J Med Chem 55:8721-34 (2012)  
Target
Name:
Potassium voltage-gated channel subfamily H member 2
Synonyms:
1,3-beta-glucan synthase component GLS2 ERG Eag-related protein 1 Ether-a-go-go-related gene (HERG) Ether-a-go-go-related gene potassium channel 1 Ether-a-go-go-related gene potassium channel 1 (hERG1) Ether-a-go-go-related protein 1 H-ERG KCNH2 Potassium voltage-gated channel subfamily H member 2 (hERG) Voltage-gated potassium channel subunit Kv11.1 hERG Potassium Channel 1 | putative potassium channel subunit
Type:
Multi-pass membrane protein
Mol. Mass.:
126672.65
Organism:
Homo sapiens (Human)
Description:
Q12809
Residue:
1159
  
Inhibitor
Name:
BDBM50401434
Synonyms:
CHEMBL2207500
Type:
Small organic molecule
Emp. Form.:
C18H20ClN9O
Mol. Mass.:
413.864
SMILES:
Cc1nn(C)cc1-c1nc2ncc(Cl)c(N3CCN(Cc4ncon4)CC3)c2[nH]1
: