Target
Carbonic anhydrase 2
Ligand
BDBM26991
Substrate
Meas. Tech.
ChEMBL_882143 (CHEMBL2214975)
Ki
89000000±n/a nM
Citation
 Vullo, DDe Luca, VScozzafava, ACarginale, VRossi, MSupuran, CTCapasso, C Anion inhibition studies of the fastest carbonic anhydrase (CA) known, the extremo-CA from the bacterium Sulfurihydrogenibium azorense. Bioorg Med Chem Lett 22:7142-5 (2012)  
Target
Name:
Carbonic anhydrase 2
Synonyms:
CA-II CAC Carbonate dehydratase II Carbonic anhydrase 2 (CA-II) Carbonic anhydrase C Carbonic anhydrase II (CA-II) Carbonic anhydrase II (hCA II) | Carbonic anhydrase isoenzyme II (hCA II)
Type:
Enzyme
Mol. Mass.:
29250.71
Organism:
Homo sapiens (Human)
Description:
P00918
Residue:
260
  
Inhibitor
Name:
BDBM26991
Synonyms:
CHEMBL1689285 bisulfite | hydrogen sulfite
Type:
Ion
Emp. Form.:
HO3S
Mol. Mass.:
81.072
SMILES:
OS([O-])=O
: