Target
Sodium-dependent dopamine transporter
Ligand
BDBM50005548
Substrate
Meas. Tech.
ChEMBL_885012 (CHEMBL2211272)
Ki
84±n/a nM
Citation
 Pechulis, ADBeck, JPCurry, MAWolf, MAHarms, AEXi, NOpalka, CSweet, MPYang, ZVellekoop, ASKlos, AMCrocker, PJHassler, CLaws, MKitchen, DBSmith, MAOlson, RELiu, SMolino, BF 4-Phenyl tetrahydroisoquinolines as dual norepinephrine and dopamine reuptake inhibitors. Bioorg Med Chem Lett 22:7219-22 (2012)  
Target
Name:
Sodium-dependent dopamine transporter
Synonyms:
DA transporter DAT1 Dopamine transporter protein (DAT) SC6A3_HUMAN Sodium-dependent dopamine transporter Solute carrier family 6 member 3
Type:
Multi-pass membrane protein
Mol. Mass.:
68497.11
Organism:
Homo sapiens (Human)
Description:
Q01959
Residue:
620
  
Inhibitor
Name:
BDBM50005548
Synonyms:
(+)-2-Methyl-4-phenyl-1,2,3,4-tetrahydro-isoquinolin-8-ylamine (-)-2-Methyl-4-phenyl-1,2,3,4-tetrahydro-isoquinolin-8-ylamine 2-Methyl-4-phenyl-1,2,3,4-tetrahydro-isoquinolin-8-ylamine 2-Methyl-4-phenyl-1,2,3,4-tetrahydro-isoquinolin-8-ylamine(Nomifensine) CHEMBL273575 NOMIFENSINE2-Methyl-4-phenyl-1,2,3,4-tetrahydro-isoquinolin-8-ylamine
Type:
Small organic molecule
Emp. Form.:
C16H18N2
Mol. Mass.:
238.3275
SMILES:
CN1CC(c2ccccc2)c2cccc(N)c2C1
: