Target
Transporter
Ligand
BDBM50401730
Substrate
Meas. Tech.
ChEMBL_885010 (CHEMBL2211270)
Ki
6.3±n/a nM
Citation
 Pechulis, ADBeck, JPCurry, MAWolf, MAHarms, AEXi, NOpalka, CSweet, MPYang, ZVellekoop, ASKlos, AMCrocker, PJHassler, CLaws, MKitchen, DBSmith, MAOlson, RELiu, SMolino, BF 4-Phenyl tetrahydroisoquinolines as dual norepinephrine and dopamine reuptake inhibitors. Bioorg Med Chem Lett 22:7219-22 (2012)  
Target
Name:
Transporter
Synonyms:
NE transporter Norepinephrine transporter(NET)
Type:
Multi-pass membrane protein
Mol. Mass.:
69236.90
Organism:
Rattus norvegicus (rat)
Description:
Q63380
Residue:
617
  
Inhibitor
Name:
BDBM50401730
Synonyms:
CHEMBL2206509
Type:
Small organic molecule
Emp. Form.:
C17H18FN
Mol. Mass.:
255.3299
SMILES:
CN1C[C@@H](c2ccc(F)cc2)c2ccc(C)cc2C1
: