Target
Sodium-dependent serotonin transporter
Ligand
BDBM50401744
Substrate
Meas. Tech.
ChEMBL_885011 (CHEMBL2211271)
Ki
81.7±n/a nM
Citation
 Pechulis, ADBeck, JPCurry, MAWolf, MAHarms, AEXi, NOpalka, CSweet, MPYang, ZVellekoop, ASKlos, AMCrocker, PJHassler, CLaws, MKitchen, DBSmith, MAOlson, RELiu, SMolino, BF 4-Phenyl tetrahydroisoquinolines as dual norepinephrine and dopamine reuptake inhibitors. Bioorg Med Chem Lett 22:7219-22 (2012)  
Target
Name:
Sodium-dependent serotonin transporter
Synonyms:
5-HT Transporter 5HTT SC6A4_HUMAN SLC6A4 Serotonin transporter (5HTT) Sodium-dependent serotonin transporter (SERT) | Solute carrier family 6 member 4
Type:
Multi-pass membrane protein
Mol. Mass.:
70322.51
Organism:
Homo sapiens (Human)
Description:
P31645
Residue:
630
  
Inhibitor
Name:
BDBM50401744
Synonyms:
CHEMBL2206525
Type:
Small organic molecule
Emp. Form.:
C16H15ClFN
Mol. Mass.:
275.748
SMILES:
CN1CC(c2ccc(Cl)c(F)c2)c2ccccc2C1
: