Target
Procathepsin L
Ligand
BDBM50401769
Substrate
Meas. Tech.
ChEMBL_885154 (CHEMBL2213245)
IC50
>20000±n/a nM
Citation
 Moss, NXiong, ZBurke, MCogan, DGao, DAHaverty, KHeim-Riether, AHickey, ERNagaraja, RNetherton, MO'Shea, KRamsden, PSchwartz, RShih, DTWard, YYoung, EZhang, Q Exploration of cathepsin S inhibitors characterized by a triazole P1-P2 amide replacement. Bioorg Med Chem Lett 22:7189-93 (2012)  
Target
Name:
Procathepsin L
Synonyms:
CATL1_HUMAN CTSL CTSL1 Cathepsin L Cathepsin L1 heavy chain MEP cathepsin L preproprotein
Type:
Enzyme
Mol. Mass.:
37557.19
Organism:
Homo sapiens (Human)
Description:
Purchased from Calbiochem (San Diego, CA).
Residue:
333
  
Inhibitor
Name:
BDBM50401769
Synonyms:
CHEMBL2207559
Type:
Small organic molecule
Emp. Form.:
C21H37N5O3
Mol. Mass.:
407.5502
SMILES:
CCC(C)(C)CC[C@H](NC(=O)N1CCOCC1)C(=O)NC1(CCN(C)CC1)C#N
: