Target
Cathepsin S
Ligand
BDBM50401769
Substrate
Meas. Tech.
ChEMBL_885153 (CHEMBL2213244)
IC50
2.8±n/a nM
Citation
 Moss, NXiong, ZBurke, MCogan, DGao, DAHaverty, KHeim-Riether, AHickey, ERNagaraja, RNetherton, MO'Shea, KRamsden, PSchwartz, RShih, DTWard, YYoung, EZhang, Q Exploration of cathepsin S inhibitors characterized by a triazole P1-P2 amide replacement. Bioorg Med Chem Lett 22:7189-93 (2012)  
Target
Name:
Cathepsin S
Synonyms:
CATS_HUMAN Cathepsin S (Cat S) | cathepsin S preproprotein
Type:
Protein
Mol. Mass.:
37507.38
Organism:
Homo sapiens (Human)
Description:
P25774
Residue:
331
  
Inhibitor
Name:
BDBM50401769
Synonyms:
CHEMBL2207559
Type:
Small organic molecule
Emp. Form.:
C21H37N5O3
Mol. Mass.:
407.5502
SMILES:
CCC(C)(C)CC[C@H](NC(=O)N1CCOCC1)C(=O)NC1(CCN(C)CC1)C#N
: