Target
Lysosomal alpha-glucosidase
Ligand
BDBM50401967
Substrate
Meas. Tech.
ChEMBL_886575 (CHEMBL2215735)
IC50
14130±n/a nM
Citation
 Patil, VSNandre, KPGhosh, SRao, VJChopade, BABhosale, SVBhosale, SV Synthesis and glycosidase inhibitory activity of novel (2-phenyl-4H-benzopyrimedo[2,1-b]-thiazol-4-yliden)acetonitrile derivatives. Bioorg Med Chem Lett 22:7011-4 (2012)  
Target
Name:
Lysosomal alpha-glucosidase
Synonyms:
α-Glucosidase Gaa Lysosomal alpha-glucosidase | alpha-glucosidase (Gaa)
Type:
Enzyme
Mol. Mass.:
106235.32
Organism:
Mus musculus (Mouse)
Description:
P70699
Residue:
953
  
Inhibitor
Name:
BDBM50401967
Synonyms:
CHEMBL2207959
Type:
Small organic molecule
Emp. Form.:
C19H12BrN3OS
Mol. Mass.:
410.287
SMILES:
COc1ccc2N3C(Sc2c1)=NC(=C\C3=C/C#N)c1ccc(Br)cc1
: