Target
Lysosomal alpha-glucosidase
Ligand
BDBM50401978
Substrate
Meas. Tech.
ChEMBL_886575 (CHEMBL2215735)
IC50
22010±n/a nM
Citation
 Patil, VSNandre, KPGhosh, SRao, VJChopade, BABhosale, SVBhosale, SV Synthesis and glycosidase inhibitory activity of novel (2-phenyl-4H-benzopyrimedo[2,1-b]-thiazol-4-yliden)acetonitrile derivatives. Bioorg Med Chem Lett 22:7011-4 (2012)  
Target
Name:
Lysosomal alpha-glucosidase
Synonyms:
α-Glucosidase Gaa Lysosomal alpha-glucosidase | alpha-glucosidase (Gaa)
Type:
Enzyme
Mol. Mass.:
106235.32
Organism:
Mus musculus (Mouse)
Description:
P70699
Residue:
953
  
Inhibitor
Name:
BDBM50401978
Synonyms:
CHEMBL2207949
Type:
Small organic molecule
Emp. Form.:
C18H10ClN3S
Mol. Mass.:
335.81
SMILES:
Clc1ccc(cc1)C1=C\C(=C/C#N)N2C(Sc3ccccc23)=N1
: