Target
Casein kinase I isoform delta
Ligand
BDBM50402020
Substrate
Meas. Tech.
ChEMBL_886823 (CHEMBL2210927)
Ki
>7800±n/a nM
Citation
 Zhang, QXia, ZMitten, MJLasko, LMKlinghofer, VBouska, JJohnson, EFPenning, TDLuo, YGiranda, VLShoemaker, ARStewart, KDDjuric, SWVasudevan, A Hit to Lead optimization of a novel class of squarate-containing polo-like kinases inhibitors. Bioorg Med Chem Lett 22:7615-22 (2012)  
Target
Name:
Casein kinase I isoform delta
Synonyms:
CKI-delta CSNK1D Casein kinase I delta Casein kinase I isoform delta (CK1D) KC1D_HUMAN | casein kinases 1 delta (CK1 delta)
Type:
Enzyme
Mol. Mass.:
47356.76
Organism:
Homo sapiens (Human)
Description:
P48730
Residue:
415
  
Inhibitor
Name:
BDBM50402020
Synonyms:
CHEMBL2205426
Type:
Small organic molecule
Emp. Form.:
C23H22N6O2
Mol. Mass.:
414.4598
SMILES:
CC(C)(C)Nc1c(Nc2ccnc(Nc3ccc(cc3)-c3ccncc3)n2)c(=O)c1=O
: