Target
MAP/microtubule affinity-regulating kinase 3
Ligand
BDBM50402020
Substrate
Meas. Tech.
ChEMBL_886827 (CHEMBL2210931)
Ki
4830±n/a nM
Citation
 Zhang, QXia, ZMitten, MJLasko, LMKlinghofer, VBouska, JJohnson, EFPenning, TDLuo, YGiranda, VLShoemaker, ARStewart, KDDjuric, SWVasudevan, A Hit to Lead optimization of a novel class of squarate-containing polo-like kinases inhibitors. Bioorg Med Chem Lett 22:7615-22 (2012)  
Target
Name:
MAP/microtubule affinity-regulating kinase 3
Synonyms:
2.7.11.1 CTAK1 ELKL motif kinase 2 EMK2 MAP/microtubule affinity-regulating kinase 3 (MARK 3) MARK3_HUMAN Protein kinase STK10 Serine/threonine-protein kinase c-TAK1 | Serine/threonine-protein kinase p78
Type:
Protein
Mol. Mass.:
84525.94
Organism:
Homo sapiens (Human)
Description:
P27448
Residue:
753
  
Inhibitor
Name:
BDBM50402020
Synonyms:
CHEMBL2205426
Type:
Small organic molecule
Emp. Form.:
C23H22N6O2
Mol. Mass.:
414.4598
SMILES:
CC(C)(C)Nc1c(Nc2ccnc(Nc3ccc(cc3)-c3ccncc3)n2)c(=O)c1=O
: