Target
Tyrosine-protein kinase JAK1
Ligand
BDBM50402074
Substrate
Meas. Tech.
ChEMBL_887157 (CHEMBL2214837)
Ki
0.2±n/a nM
Citation
 Labadie, SDragovich, PSBarrett, KBlair, WSBergeron, PChang, CDeshmukh, GEigenbrot, CGhilardi, NGibbons, PHurley, CAJohnson, AKenny, JRKohli, PBKulagowski, JJLiimatta, MLupardus, PJMendonca, RMurray, JMPulk, RShia, SSteffek, MUbhayakar, SUltsch, Mvan Abbema, AWard, SZak, M Structure-based discovery of C-2 substituted imidazo-pyrrolopyridine JAK1 inhibitors with improved selectivity over JAK2. Bioorg Med Chem Lett 22:7627-33 (2012)  
Target
Name:
Tyrosine-protein kinase JAK1
Synonyms:
JAK-1 JAK1A JAK1_HUMAN Janus kinase 1 (JAK1) | Janus kinase 1 JAK1
Type:
Protein
Mol. Mass.:
133293.73
Organism:
Homo sapiens (Human)
Description:
P23458
Residue:
1154
  
Inhibitor
Name:
BDBM50402074
Synonyms:
CHEMBL2206059 US10766894, Compound TABLE 1.9 | US11203595, TABLE 1.9
Type:
Small organic molecule
Emp. Form.:
C17H21N5O2S
Mol. Mass.:
359.446
SMILES:
CS(=O)(=O)NCc1nc2cnc3[nH]ccc3c2n1[C@@H]1C[C@H]2CC[C@@H]1C2
: