Target
Histamine H1 receptor
Ligand
BDBM50402110
Substrate
Meas. Tech.
ChEMBL_884700 (CHEMBL2215148)
Ki
15.85±n/a nM
Citation
 Furber, MAlcaraz, LLuckhurst, CBahl, ABeaton, HBowers, KCollington, JDenton, RDonald, DKinchin, EMacDonald, CRigby, ARiley, RSoars, MSpringthorpe, BWebborn, P Discovery and evolution of phenoxypiperidine hydroxyamide dual CCR3/H1 antagonists. Part II: optimising in vivo clearance. Bioorg Med Chem Lett 22:7707-10 (2012)  
Target
Name:
Histamine H1 receptor
Synonyms:
H1R HISTAMINE H1 HRH1_HUMAN
Type:
G Protein-Coupled Receptor (GPCR)
Mol. Mass.:
55808.72
Organism:
Homo sapiens (Human)
Description:
Cell pellets from SK-N-MC cells transfected with human H1 receptor were used in binding assay.
Residue:
487
  
Inhibitor
Name:
BDBM50402110
Synonyms:
CHEMBL2207658
Type:
Small organic molecule
Emp. Form.:
C19H21Cl2F3N4O3
Mol. Mass.:
481.296
SMILES:
O[C@H](CNC(=O)c1cn[nH]c1C(F)(F)F)CN1CCC(CC1)Oc1ccc(Cl)c(Cl)c1
: