Target
Histamine H1 receptor
Ligand
BDBM50402128
Substrate
Meas. Tech.
ChEMBL_884700 (CHEMBL2215148)
Ki
251.19±n/a nM
Citation
 Furber, MAlcaraz, LLuckhurst, CBahl, ABeaton, HBowers, KCollington, JDenton, RDonald, DKinchin, EMacDonald, CRigby, ARiley, RSoars, MSpringthorpe, BWebborn, P Discovery and evolution of phenoxypiperidine hydroxyamide dual CCR3/H1 antagonists. Part II: optimising in vivo clearance. Bioorg Med Chem Lett 22:7707-10 (2012)  
Target
Name:
Histamine H1 receptor
Synonyms:
H1R HISTAMINE H1 HRH1_HUMAN
Type:
G Protein-Coupled Receptor (GPCR)
Mol. Mass.:
55808.72
Organism:
Homo sapiens (Human)
Description:
Cell pellets from SK-N-MC cells transfected with human H1 receptor were used in binding assay.
Residue:
487
  
Inhibitor
Name:
BDBM50402128
Synonyms:
CHEMBL2207670
Type:
Small organic molecule
Emp. Form.:
C26H27ClN4O6S
Mol. Mass.:
559.034
SMILES:
CS(=O)(=O)c1ccc2c(c[nH]c(=O)c2c1)C(=O)NC[C@@H](O)CN1CCC(CC1)Oc1ccc(C#N)c(Cl)c1
: