Target
C-C chemokine receptor type 3
Ligand
BDBM50402119
Substrate
Meas. Tech.
ChEMBL_884699 (CHEMBL2215147)
Ki
25.12±n/a nM
Citation
 Furber, MAlcaraz, LLuckhurst, CBahl, ABeaton, HBowers, KCollington, JDenton, RDonald, DKinchin, EMacDonald, CRigby, ARiley, RSoars, MSpringthorpe, BWebborn, P Discovery and evolution of phenoxypiperidine hydroxyamide dual CCR3/H1 antagonists. Part II: optimising in vivo clearance. Bioorg Med Chem Lett 22:7707-10 (2012)  
Target
Name:
C-C chemokine receptor type 3
Synonyms:
C-C CKR-3 CC-CKR-3 CCR3 CD_antigen=CD193 CMKBR3 | Eosinophil eotaxin receptor
Type:
Enzyme
Mol. Mass.:
41053.88
Organism:
Homo sapiens (Human)
Description:
P51677
Residue:
355
  
Inhibitor
Name:
BDBM50402119
Synonyms:
CHEMBL2207282
Type:
Small organic molecule
Emp. Form.:
C24H26Cl2N4O6S
Mol. Mass.:
569.457
SMILES:
NS(=O)(=O)c1ccc2c(c[nH]c(=O)c2c1)C(=O)NC[C@@H](O)CN1CCC(CC1)Oc1ccc(Cl)c(Cl)c1
: