Target
Histamine H1 receptor
Ligand
BDBM50402132
Substrate
Meas. Tech.
ChEMBL_884700 (CHEMBL2215148)
Ki
5.01±n/a nM
Citation
 Furber, MAlcaraz, LLuckhurst, CBahl, ABeaton, HBowers, KCollington, JDenton, RDonald, DKinchin, EMacDonald, CRigby, ARiley, RSoars, MSpringthorpe, BWebborn, P Discovery and evolution of phenoxypiperidine hydroxyamide dual CCR3/H1 antagonists. Part II: optimising in vivo clearance. Bioorg Med Chem Lett 22:7707-10 (2012)  
Target
Name:
Histamine H1 receptor
Synonyms:
H1R HISTAMINE H1 HRH1_HUMAN
Type:
G Protein-Coupled Receptor (GPCR)
Mol. Mass.:
55808.72
Organism:
Homo sapiens (Human)
Description:
Cell pellets from SK-N-MC cells transfected with human H1 receptor were used in binding assay.
Residue:
487
  
Inhibitor
Name:
BDBM50402132
Synonyms:
CHEMBL2207665
Type:
Small organic molecule
Emp. Form.:
C22H24Cl2F3N3O4
Mol. Mass.:
522.345
SMILES:
Cn1cc(C(=O)NC[C@@H](O)CN2CCC(CC2)Oc2ccc(Cl)c(Cl)c2)c(cc1=O)C(F)(F)F
: