Target
Lactoylglutathione lyase
Ligand
BDBM50402208
Substrate
Meas. Tech.
ChEMBL_885082 (CHEMBL2212266)
IC50
280±n/a nM
Citation
 Chiba, TOhwada, JSakamoto, HKobayashi, TFukami, TAIrie, MMiura, TOhara, KKoyano, H Design and evaluation of azaindole-substituted N-hydroxypyridones as glyoxalase I inhibitors. Bioorg Med Chem Lett 22:7486-9 (2012)  
Target
Name:
Lactoylglutathione lyase
Synonyms:
Aldoketomutase Glx I Glyoxalase I LGUL_HUMAN S-D-lactoylglutathione methylglyoxal lyase
Type:
Enzyme
Mol. Mass.:
20772.95
Organism:
Homo sapiens (Human)
Description:
Q04760
Residue:
184
  
Inhibitor
Name:
BDBM50402208
Synonyms:
CHEMBL2203974
Type:
Small organic molecule
Emp. Form.:
C18H13N3O2
Mol. Mass.:
303.3147
SMILES:
On1c(cc(cc1=O)-c1ccccc1)-c1cnc2[nH]ccc2c1
: