Target
Amine oxidase [flavin-containing] A
Ligand
BDBM50402322
Substrate
Meas. Tech.
ChEMBL_885770 (CHEMBL2213281)
IC50
250000±n/a nM
Citation
 Mostert, SMentz, WPetzer, ABergh, JJPetzer, JP Inhibition of monoamine oxidase by 8-[(phenylethyl)sulfanyl]caffeine analogues. Bioorg Med Chem 20:7040-50 (2012)  
Target
Name:
Amine oxidase [flavin-containing] A
Synonyms:
AOFA_HUMAN MAO-A Monoamine oxidase Monoamine oxidase type A (MAO A) Monoamine oxidase type A (MAOA)
Type:
Protein
Mol. Mass.:
59689.53
Organism:
Homo sapiens (Human)
Description:
P21397
Residue:
527
  
Inhibitor
Name:
BDBM50402322
Synonyms:
CHEMBL2206101
Type:
Small organic molecule
Emp. Form.:
C15H16N4O3S
Mol. Mass.:
332.378
SMILES:
Cn1c(nc2n(C)c(=O)n(C)c(=O)c12)S(=O)Cc1ccccc1
: