Target
Cholinesterase
Ligand
BDBM50402576
Substrate
Meas. Tech.
ChEMBL_886760 (CHEMBL2210074)
IC50
494±n/a nM
Citation
 Alipour, MKhoobi, MForoumadi, ANadri, HMoradi, ASakhteman, AGhandi, MShafiee, A Novel coumarin derivatives bearing N-benzyl pyridinium moiety: potent and dual binding site acetylcholinesterase inhibitors. Bioorg Med Chem 20:7214-22 (2012)  
Target
Name:
Cholinesterase
Synonyms:
BCHE CHLE_HORSE | Cholinesterase
Type:
Enzyme
Mol. Mass.:
65643.35
Organism:
Equus caballus (Horse)
Description:
P81908
Residue:
574
  
Inhibitor
Name:
BDBM50402576
Synonyms:
CHEMBL2206130
Type:
Small organic molecule
Emp. Form.:
C24H16BrFNO3
Mol. Mass.:
465.291
SMILES:
Fc1ccc(C[n+]2ccc(\C=C\C(=O)c3cc4cc(Br)ccc4oc3=O)cc2)cc1
: